{"text_format":"1","workbook":"xlsx","n_sheets":7,"sheets":["Parameters","XOM","MCD","BP","KO","KKR","Collated Dividends"],"not_rendered":{"charts":0,"images":1,"macros":1,"external_links":0,"defined_names":10,"comments":0,"pivot_tables":0},"unopened":[],"bounds":{"document_bytes":16777216,"sheet_cells":100000,"rows_first":2000,"rows_last":500,"rows_between":2000,"halvings":0,"cell_chars":16384,"cell_head_chars":4096},"cells_cut":0,"cells_raw":0,"read":"whole","date_system":"1900"}

{"sheet":"Parameters","index":0,"n_rows":16,"n_cols":12,"rows_kept":16,"cut":false,"hidden":false,"merged":[]}
["Bulk Dividend Analyzer"]
["http://investexcel.net",null,null,null,null,null,null,null,null,"Samir Khan"]
[null,null,null,null,null,null,null,null,null,"simulationconsultant@gmail.com"]
["Parameters",null,null,null,null,null,null,false]
["Start Date",2000,null,null,null,null,null,true,null,"Please link to http://investexcel.net if you like this spreadsheet :)"]
["End Date",2014,null,null,null,null,null,true]
[null,"c:\\temp\\"]
[]
[]
[null,null,null,null,null,null,null,null,null,"Failed for these Tickers",null,"Success for these Tickers"]
["Enter Tickers Below",null,null,null,null,null,null,null,null,null,null,"XOM"]
["XOM",null,null,null,null,null,null,null,null,null,null,"MCD"]
["MCD",null,null,null,null,null,null,null,null,null,null,"BP"]
["BP",null,null,null,null,null,null,null,null,null,null,"KO"]
["KO",null,null,null,null,null,null,null,null,null,null,"KKR"]
["KKR"]

{"sheet":"XOM","index":1,"n_rows":63,"n_cols":8,"rows_kept":63,"cut":false,"hidden":false,"merged":[]}
["Historical Dividends for XOM"]
["Date","Dividends",null,"Year","Total Dividends","Growth Rate","Start Date","2000-02-09"]
["2000-02-09",0.22,null,2000,0.88,null,"End Date","2014-11-07"]
["2000-05-11",0.22,null,2001,0.91,{"$f":" (E4 - E3) / E3","v":3.4090909090909123E-2},"Days in Range",5385]
["2000-08-10",0.22,null,2002,0.92,1.0989010989010999E-2,"Years in Range",15]
["2000-11-09",0.22,null,2003,0.98,6.5217391304347755E-2,"Start Dividend",0.88]
["2001-02-07",0.22,null,2004,1.06,8.1632653061224567E-2,"End Dividend",2.6999999999999997]
["2001-05-10",0.22,null,2005,1.1400000000000001,7.5471698113207614E-2,"CAGR",7.7602870213686392E-2]
["2001-06-18",0.01,null,2006,1.28,0.12280701754385955]
["2001-08-09",0.23,null,2007,1.37,7.0312500000000056E-2]
["2001-11-07",0.23,null,2008,1.5499999999999998,0.1313868613138684]
["2002-02-07",0.23,null,2009,1.66,7.0967741935483941E-2]
["2002-05-09",0.23,null,2010,1.74,4.8192771084337394E-2]
["2002-08-09",0.23,null,2011,1.8499999999999999,6.3218390804597624E-2]
["2002-11-07",0.23,null,2012,2.1799999999999997,0.17837837837837831]
["2003-02-06",0.23,null,2013,2.46,0.12844036697247718]
["2003-05-09",0.25,null,2014,2.6999999999999997,9.7560975609756004E-2]
["2003-08-11",0.25]
["2003-11-07",0.25,null,null,"Average Growth",{"$f":"AVERAGE(F4:F17)","v":8.4190476157247035E-2}]
["2004-02-09",0.25]
["2004-05-11",0.27]
["2004-08-11",0.27]
["2004-11-09",0.27]
["2005-02-08",0.27]
["2005-05-11",0.28999999999999998]
["2005-08-10",0.28999999999999998]
["2005-11-08",0.28999999999999998]
["2006-02-08",0.32]
["2006-05-10",0.32]
["2006-08-10",0.32]
["2006-11-09",0.32]
["2007-02-07",0.32]
["2007-05-10",0.35]
["2007-08-09",0.35]
["2007-11-07",0.35]
["2008-02-07",0.35]
["2008-05-09",0.4]
["2008-08-11",0.4]
["2008-11-07",0.4]
["2009-02-06",0.4]
["2009-05-11",0.42]
["2009-08-11",0.42]
["2009-11-09",0.42]
["2010-02-08",0.42]
["2010-05-11",0.44]
["2010-08-11",0.44]
["2010-11-09",0.44]
["2011-02-08",0.44]
["2011-05-11",0.47]
["2011-08-10",0.47]
["2011-11-08",0.47]
["2012-02-08",0.47]
["2012-05-10",0.56999999999999995]
["2012-08-09",0.56999999999999995]
["2012-11-07",0.56999999999999995]
["2013-02-07",0.56999999999999995]
["2013-05-09",0.63]
["2013-08-09",0.63]
["2013-11-07",0.63]
["2014-02-06",0.63]
["2014-05-09",0.69]
["2014-08-11",0.69]
["2014-11-07",0.69]

{"sheet":"MCD","index":2,"n_rows":38,"n_cols":8,"rows_kept":38,"cut":false,"hidden":false,"merged":[]}
["Historical Dividends for MCD"]
["Date","Dividends",null,"Year","Total Dividends","Growth Rate","Start Date","2000-11-13"]
["2000-11-13",0.215,null,2000,0.215,null,"End Date","2014-11-26"]
["2001-11-13",0.22500000000000001,null,2001,0.22500000000000001,{"$f":" (E4 - E3) / E3","v":4.6511627906976785E-2},"Days in Range",5126]
["2002-11-13",0.23499999999999999,null,2002,0.23499999999999999,4.4444444444444363E-2,"Years in Range",14]
["2003-11-12",0.4,null,2003,0.4,0.70212765957446832,"Start Dividend",0.215]
["2004-11-10",0.55000000000000004,null,2004,0.55000000000000004,0.37500000000000006,"End Dividend",3.2800000000000002]
["2005-11-10",0.67,null,2005,0.67,0.21818181818181814,"CAGR",0.21487361169974539]
["2006-11-13",1,null,2006,1,0.49253731343283574]
["2007-11-13",1.5,null,2007,1.5,0.5]
["2008-02-28",0.375,null,2008,1.625,8.3333333333333329E-2]
["2008-06-05",0.375,null,2009,2.0499999999999998,0.26153846153846144]
["2008-08-28",0.375,null,2010,2.2600000000000002,0.1024390243902441]
["2008-11-26",0.5,null,2011,2.5300000000000002,0.11946902654867256]
["2009-02-26",0.5,null,2012,2.8699999999999997,0.13438735177865588]
["2009-06-04",0.5,null,2013,3.12,8.7108013937282389E-2]
["2009-08-28",0.5,null,2014,3.2800000000000002,5.1282051282051329E-2]
["2009-11-27",0.55000000000000004]
["2010-02-25",0.55000000000000004,null,null,"Average Growth",{"$f":"AVERAGE(F4:F17)","v":0.22988286616780318}]
["2010-05-27",0.55000000000000004]
["2010-08-30",0.55000000000000004]
["2010-11-29",0.61]
["2011-02-25",0.61]
["2011-05-27",0.61]
["2011-08-30",0.61]
["2011-11-29",0.7]
["2012-02-28",0.7]
["2012-05-31",0.7]
["2012-08-30",0.7]
["2012-11-29",0.77]
["2013-02-27",0.77]
["2013-05-30",0.77]
["2013-08-29",0.77]
["2013-11-27",0.81]
["2014-02-27",0.81]
["2014-05-29",0.81]
["2014-08-28",0.81]
["2014-11-26",0.85]

{"sheet":"BP","index":3,"n_rows":60,"n_cols":8,"rows_kept":60,"cut":false,"hidden":false,"merged":[]}
["Historical Dividends for BP"]
["Date","Dividends",null,"Year","Total Dividends","Growth Rate","Start Date","2000-02-23"]
["2000-02-23",0.33300000000000002,null,2000,1.3490000000000002,null,"End Date","2014-11-05"]
["2000-05-17",0.33300000000000002,null,2001,1.4339999999999999,{"$f":" (E4 - E3) / E3","v":6.3009636767976079E-2},"Days in Range",5369]
["2000-08-16",0.33300000000000002,null,2002,1.5659999999999998,9.2050209205020855E-2,"Years in Range",15]
["2000-11-15",0.35,null,2003,1.6580000000000001,5.8748403575989983E-2,"Start Dividend",1.3490000000000002]
["2001-02-21",0.35,null,2004,1.7069999999999999,2.9553679131483539E-2,"End Dividend",2.34]
["2001-05-16",0.35,null,2005,2.0920000000000001,0.22554188635032235,"CAGR",3.7401632738625512E-2]
["2001-08-15",0.36699999999999999,null,2006,2.3059999999999996,0.10229445506692138]
["2001-11-14",0.36699999999999999,null,2007,2.54,0.10147441457068537]
["2002-02-20",0.38300000000000001,null,2008,3.3039999999999998,0.30078740157480305]
["2002-05-15",0.38300000000000001,null,2009,3.36,1.6949152542372899E-2]
["2002-08-14",0.4,null,2010,1.68,-0.5]
["2002-11-13",0.4,null,2011,1.68,0]
["2003-02-26",0.41699999999999998,null,2012,1.98,0.1785714285714286]
["2003-05-14",0.375,null,2013,2.19,0.10606060606060605]
["2003-08-13",0.433,null,2014,2.34,6.8493150684931461E-2]
["2003-11-12",0.433]
["2004-02-18",0.45,null,null,"Average Growth",{"$f":"AVERAGE(F4:F17)","v":6.0252458864467263E-2}]
["2004-05-12",0.40500000000000003]
["2004-08-11",0.42599999999999999]
["2004-11-09",0.42599999999999999]
["2005-02-16",0.51]
["2005-05-11",0.51]
["2005-08-10",0.53600000000000003]
["2005-11-08",0.53600000000000003]
["2006-02-22",0.56299999999999994]
["2006-05-10",0.56299999999999994]
["2006-08-09",0.59]
["2006-11-08",0.59]
["2007-02-21",0.62]
["2007-05-09",0.62]
["2007-08-08",0.65]
["2007-11-07",0.65]
["2008-02-20",0.81200000000000006]
["2008-05-14",0.81200000000000006]
["2008-08-13",0.84]
["2008-11-12",0.84]
["2009-02-18",0.84]
["2009-05-13",0.84]
["2009-08-12",0.84]
["2009-11-10",0.84]
["2010-02-17",0.84]
["2010-05-05",0.84]
["2011-02-09",0.42]
["2011-05-11",0.42]
["2011-08-03",0.42]
["2011-11-02",0.42]
["2012-02-15",0.48]
["2012-05-09",0.48]
["2012-08-08",0.48]
["2012-11-07",0.54]
["2013-02-13",0.54]
["2013-05-08",0.54]
["2013-08-07",0.54]
["2013-11-06",0.56999999999999995]
["2014-02-12",0.56999999999999995]
["2014-05-07",0.58499999999999996]
["2014-08-06",0.58499999999999996]
["2014-11-05",0.6]

{"sheet":"KO","index":4,"n_rows":62,"n_cols":8,"rows_kept":62,"cut":false,"hidden":false,"merged":[]}
["Historical Dividends for KO"]
["Date","Dividends",null,"Year","Total Dividends","Growth Rate","Start Date","2000-03-13"]
["2000-03-13",8.5000000000000006E-2,null,2000,0.34,null,"End Date","2014-11-26"]
["2000-06-13",8.5000000000000006E-2,null,2001,0.44999999999999996,{"$f":" (E4 - E3) / E3","v":0.32352941176470568},"Days in Range",5371]
["2000-09-13",8.5000000000000006E-2,null,2002,0.4,-0.11111111111111098,"Years in Range",15]
["2000-11-29",8.5000000000000006E-2,null,2003,0.44,9.999999999999995E-2,"Start Dividend",0.34]
["2001-03-13",0.09,null,2004,0.5,0.13636363636363635,"End Dividend",1.22]
["2001-06-13",0.09,null,2005,0.56000000000000005,0.12000000000000011,"CAGR",8.8910187401794571E-2]
["2001-09-12",0.18,null,2006,0.62,0.10714285714285703]
["2001-11-28",0.09,null,2007,0.68,9.6774193548387177E-2]
["2002-03-13",0.1,null,2008,0.76,0.11764705882352934]
["2002-06-12",0.1,null,2009,0.82,7.8947368421052558E-2]
["2002-09-11",0.1,null,2010,0.88,7.3170731707317138E-2]
["2002-11-26",0.1,null,2011,0.94,6.8181818181818121E-2]
["2003-03-12",0.11,null,2012,1.02,8.5106382978723485E-2]
["2003-06-11",0.11,null,2013,1.1200000000000001,9.8039215686274592E-2]
["2003-09-11",0.11,null,2014,1.22,8.9285714285714163E-2]
["2003-11-26",0.11]
["2004-03-11",0.125,null,null,"Average Growth",{"$f":"AVERAGE(F4:F17)","v":9.8791234128064634E-2}]
["2004-06-14",0.125]
["2004-09-13",0.125]
["2004-11-29",0.125]
["2005-03-11",0.14000000000000001]
["2005-06-13",0.14000000000000001]
["2005-09-13",0.14000000000000001]
["2005-11-29",0.14000000000000001]
["2006-03-13",0.155]
["2006-06-13",0.155]
["2006-09-13",0.155]
["2006-11-29",0.155]
["2007-03-13",0.17]
["2007-06-13",0.17]
["2007-09-12",0.17]
["2007-11-28",0.17]
["2008-03-12",0.19]
["2008-06-11",0.19]
["2008-09-11",0.19]
["2008-11-26",0.19]
["2009-03-11",0.20499999999999999]
["2009-06-11",0.20499999999999999]
["2009-09-11",0.20499999999999999]
["2009-11-27",0.20499999999999999]
["2010-03-11",0.22]
["2010-06-11",0.22]
["2010-09-13",0.22]
["2010-11-29",0.22]
["2011-03-11",0.23499999999999999]
["2011-06-13",0.23499999999999999]
["2011-09-13",0.23499999999999999]
["2011-11-29",0.23499999999999999]
["2012-03-13",0.255]
["2012-06-13",0.255]
["2012-09-12",0.255]
["2012-11-28",0.255]
["2013-03-13",0.28000000000000003]
["2013-06-12",0.28000000000000003]
["2013-09-12",0.28000000000000003]
["2013-11-27",0.28000000000000003]
["2014-03-12",0.30499999999999999]
["2014-06-12",0.30499999999999999]
["2014-09-11",0.30499999999999999]
["2014-11-26",0.30499999999999999]

{"sheet":"KKR","index":5,"n_rows":20,"n_cols":8,"rows_kept":20,"cut":false,"hidden":false,"merged":[]}
["Historical Dividends for KKR"]
["Date","Dividends",null,"Year","Total Dividends","Growth Rate","Start Date","2010-08-20"]
["2010-08-20",0.08,null,2010,0.22999999999999998,null,"End Date","2014-10-30"]
["2010-11-09",0.15,null,2011,0.71,{"$f":" (E4 - E3) / E3","v":2.0869565217391304},"Days in Range",1532]
["2011-03-03",0.28999999999999998,null,2012,0.84,0.18309859154929578,"Years in Range",4]
["2011-05-12",0.21,null,2013,1.6199999999999999,0.92857142857142849,"Start Dividend",0.22999999999999998]
["2011-08-11",0.11,null,2014,2.0300000000000002,0.25308641975308666,"End Dividend",2.0300000000000002]
["2011-11-09",0.1,null,null,null,null,"CAGR",0.72362208638398973]
["2012-02-16",0.32,null,null,"Average Growth",{"$f":"AVERAGE(F4:F7)","v":0.86292824040323535}]
["2012-05-03",0.15]
["2012-08-02",0.13]
["2012-11-01",0.24]
["2013-02-14",0.7]
["2013-05-02",0.27]
["2013-08-01",0.42]
["2013-10-31",0.23]
["2014-02-13",0.48]
["2014-05-07",0.43]
["2014-07-31",0.67]
["2014-10-30",0.45]

{"sheet":"Collated Dividends","index":6,"n_rows":5480,"n_cols":6,"rows_kept":5480,"cut":false,"hidden":false,"merged":[]}
[null,"XOM","MCD","BP","KO","KKR"]
["2000-01-01"]
["2000-01-02"]
["2000-01-03"]
["2000-01-04"]
["2000-01-05"]
["2000-01-06"]
["2000-01-07"]
["2000-01-08"]
["2000-01-09"]
["2000-01-10"]
["2000-01-11"]
["2000-01-12"]
["2000-01-13"]
["2000-01-14"]
["2000-01-15"]
["2000-01-16"]
["2000-01-17"]
["2000-01-18"]
["2000-01-19"]
["2000-01-20"]
["2000-01-21"]
["2000-01-22"]
["2000-01-23"]
["2000-01-24"]
["2000-01-25"]
["2000-01-26"]
["2000-01-27"]
["2000-01-28"]
["2000-01-29"]
["2000-01-30"]
["2000-01-31"]
["2000-02-01"]
["2000-02-02"]
["2000-02-03"]
["2000-02-04"]
["2000-02-05"]
["2000-02-06"]
["2000-02-07"]
["2000-02-08"]
["2000-02-09",{"$f":"VLOOKUP(A41,XOM!A$2:B$5479,2,0)","v":0.22}]
["2000-02-10"]
["2000-02-11"]
["2000-02-12"]
["2000-02-13"]
["2000-02-14"]
["2000-02-15"]
["2000-02-16"]
["2000-02-17"]
["2000-02-18"]
["2000-02-19"]
["2000-02-20"]
["2000-02-21"]
["2000-02-22"]
["2000-02-23",null,null,{"$f":"VLOOKUP(A55,BP!A$2:B$5479,2,0)","v":0.33300000000000002}]
["2000-02-24"]
["2000-02-25"]
["2000-02-26"]
["2000-02-27"]
["2000-02-28"]
["2000-02-29"]
["2000-03-01"]
["2000-03-02"]
["2000-03-03"]
["2000-03-04"]
["2000-03-05"]
["2000-03-06"]
["2000-03-07"]
["2000-03-08"]
["2000-03-09"]
["2000-03-10"]
["2000-03-11"]
["2000-03-12"]
["2000-03-13",null,null,null,{"$f":"VLOOKUP(A74,KO!A$2:B$5479,2,0)","v":8.5000000000000006E-2}]
["2000-03-14"]
["2000-03-15"]
["2000-03-16"]
["2000-03-17"]
["2000-03-18"]
["2000-03-19"]
["2000-03-20"]
["2000-03-21"]
["2000-03-22"]
["2000-03-23"]
["2000-03-24"]
["2000-03-25"]
["2000-03-26"]
["2000-03-27"]
["2000-03-28"]
["2000-03-29"]
["2000-03-30"]
["2000-03-31"]
["2000-04-01"]
["2000-04-02"]
["2000-04-03"]
["2000-04-04"]
["2000-04-05"]
["2000-04-06"]
["2000-04-07"]
["2000-04-08"]
["2000-04-09"]
["2000-04-10"]
["2000-04-11"]
["2000-04-12"]
["2000-04-13"]
["2000-04-14"]
["2000-04-15"]
["2000-04-16"]
["2000-04-17"]
["2000-04-18"]
["2000-04-19"]
["2000-04-20"]
["2000-04-21"]
["2000-04-22"]
["2000-04-23"]
["2000-04-24"]
["2000-04-25"]
["2000-04-26"]
["2000-04-27"]
["2000-04-28"]
["2000-04-29"]
["2000-04-30"]
["2000-05-01"]
["2000-05-02"]
["2000-05-03"]
["2000-05-04"]
["2000-05-05"]
["2000-05-06"]
["2000-05-07"]
["2000-05-08"]
["2000-05-09"]
["2000-05-10"]
["2000-05-11",{"$f":"VLOOKUP(A133,XOM!A$2:B$5479,2,0)","v":0.22}]
["2000-05-12"]
["2000-05-13"]
["2000-05-14"]
["2000-05-15"]
["2000-05-16"]
["2000-05-17",null,null,{"$f":"VLOOKUP(A139,BP!A$2:B$5479,2,0)","v":0.33300000000000002}]
["2000-05-18"]
["2000-05-19"]
["2000-05-20"]
["2000-05-21"]
["2000-05-22"]
["2000-05-23"]
["2000-05-24"]
["2000-05-25"]
["2000-05-26"]
["2000-05-27"]
["2000-05-28"]
["2000-05-29"]
["2000-05-30"]
["2000-05-31"]
["2000-06-01"]
["2000-06-02"]
["2000-06-03"]
["2000-06-04"]
["2000-06-05"]
["2000-06-06"]
["2000-06-07"]
["2000-06-08"]
["2000-06-09"]
["2000-06-10"]
["2000-06-11"]
["2000-06-12"]
["2000-06-13",null,null,null,{"$f":"VLOOKUP(A166,KO!A$2:B$5479,2,0)","v":8.5000000000000006E-2}]
["2000-06-14"]
["2000-06-15"]
["2000-06-16"]
["2000-06-17"]
["2000-06-18"]
["2000-06-19"]
["2000-06-20"]
["2000-06-21"]
["2000-06-22"]
["2000-06-23"]
["2000-06-24"]
["2000-06-25"]
["2000-06-26"]
["2000-06-27"]
["2000-06-28"]
["2000-06-29"]
["2000-06-30"]
["2000-07-01"]
["2000-07-02"]
["2000-07-03"]
["2000-07-04"]
["2000-07-05"]
["2000-07-06"]
["2000-07-07"]
["2000-07-08"]
["2000-07-09"]
["2000-07-10"]
["2000-07-11"]
["2000-07-12"]
["2000-07-13"]
["2000-07-14"]
["2000-07-15"]
["2000-07-16"]
["2000-07-17"]
["2000-07-18"]
["2000-07-19"]
["2000-07-20"]
["2000-07-21"]
["2000-07-22"]
["2000-07-23"]
["2000-07-24"]
["2000-07-25"]
["2000-07-26"]
["2000-07-27"]
["2000-07-28"]
["2000-07-29"]
["2000-07-30"]
["2000-07-31"]
["2000-08-01"]
["2000-08-02"]
["2000-08-03"]
["2000-08-04"]
["2000-08-05"]
["2000-08-06"]
["2000-08-07"]
["2000-08-08"]
["2000-08-09"]
["2000-08-10",{"$f":"VLOOKUP(A224,XOM!A$2:B$5479,2,0)","v":0.22}]
["2000-08-11"]
["2000-08-12"]
["2000-08-13"]
["2000-08-14"]
["2000-08-15"]
["2000-08-16",null,null,{"$f":"VLOOKUP(A230,BP!A$2:B$5479,2,0)","v":0.33300000000000002}]
["2000-08-17"]
["2000-08-18"]
["2000-08-19"]
["2000-08-20"]
["2000-08-21"]
["2000-08-22"]
["2000-08-23"]
["2000-08-24"]
["2000-08-25"]
["2000-08-26"]
["2000-08-27"]
["2000-08-28"]
["2000-08-29"]
["2000-08-30"]
["2000-08-31"]
["2000-09-01"]
["2000-09-02"]
["2000-09-03"]
["2000-09-04"]
["2000-09-05"]
["2000-09-06"]
["2000-09-07"]
["2000-09-08"]
["2000-09-09"]
["2000-09-10"]
["2000-09-11"]
["2000-09-12"]
["2000-09-13",null,null,null,{"$f":"VLOOKUP(A258,KO!A$2:B$5479,2,0)","v":8.5000000000000006E-2}]
["2000-09-14"]
["2000-09-15"]
["2000-09-16"]
["2000-09-17"]
["2000-09-18"]
["2000-09-19"]
["2000-09-20"]
["2000-09-21"]
["2000-09-22"]
["2000-09-23"]
["2000-09-24"]
["2000-09-25"]
["2000-09-26"]
["2000-09-27"]
["2000-09-28"]
["2000-09-29"]
["2000-09-30"]
["2000-10-01"]
["2000-10-02"]
["2000-10-03"]
["2000-10-04"]
["2000-10-05"]
["2000-10-06"]
["2000-10-07"]
["2000-10-08"]
["2000-10-09"]
["2000-10-10"]
["2000-10-11"]
["2000-10-12"]
["2000-10-13"]
["2000-10-14"]
["2000-10-15"]
["2000-10-16"]
["2000-10-17"]
["2000-10-18"]
["2000-10-19"]
["2000-10-20"]
["2000-10-21"]
["2000-10-22"]
["2000-10-23"]
["2000-10-24"]
["2000-10-25"]
["2000-10-26"]
["2000-10-27"]
["2000-10-28"]
["2000-10-29"]
["2000-10-30"]
["2000-10-31"]
["2000-11-01"]
["2000-11-02"]
["2000-11-03"]
["2000-11-04"]
["2000-11-05"]
["2000-11-06"]
["2000-11-07"]
["2000-11-08"]
["2000-11-09",{"$f":"VLOOKUP(A315,XOM!A$2:B$5479,2,0)","v":0.22}]
["2000-11-10"]
["2000-11-11"]
["2000-11-12"]
["2000-11-13",null,{"$f":"VLOOKUP(A319,MCD!A$2:B$5479,2,0)","v":0.215}]
["2000-11-14"]
["2000-11-15",null,null,{"$f":"VLOOKUP(A321,BP!A$2:B$5479,2,0)","v":0.35}]
["2000-11-16"]
["2000-11-17"]
["2000-11-18"]
["2000-11-19"]
["2000-11-20"]
["2000-11-21"]
["2000-11-22"]
["2000-11-23"]
["2000-11-24"]
["2000-11-25"]
["2000-11-26"]
["2000-11-27"]
["2000-11-28"]
["2000-11-29",null,null,null,{"$f":"VLOOKUP(A335,KO!A$2:B$5479,2,0)","v":8.5000000000000006E-2}]
["2000-11-30"]
["2000-12-01"]
["2000-12-02"]
["2000-12-03"]
["2000-12-04"]
["2000-12-05"]
["2000-12-06"]
["2000-12-07"]
["2000-12-08"]
["2000-12-09"]
["2000-12-10"]
["2000-12-11"]
["2000-12-12"]
["2000-12-13"]
["2000-12-14"]
["2000-12-15"]
["2000-12-16"]
["2000-12-17"]
["2000-12-18"]
["2000-12-19"]
["2000-12-20"]
["2000-12-21"]
["2000-12-22"]
["2000-12-23"]
["2000-12-24"]
["2000-12-25"]
["2000-12-26"]
["2000-12-27"]
["2000-12-28"]
["2000-12-29"]
["2000-12-30"]
["2000-12-31"]
["2001-01-01"]
["2001-01-02"]
["2001-01-03"]
["2001-01-04"]
["2001-01-05"]
["2001-01-06"]
["2001-01-07"]
["2001-01-08"]
["2001-01-09"]
["2001-01-10"]
["2001-01-11"]
["2001-01-12"]
["2001-01-13"]
["2001-01-14"]
["2001-01-15"]
["2001-01-16"]
["2001-01-17"]
["2001-01-18"]
["2001-01-19"]
["2001-01-20"]
["2001-01-21"]
["2001-01-22"]
["2001-01-23"]
["2001-01-24"]
["2001-01-25"]
["2001-01-26"]
["2001-01-27"]
["2001-01-28"]
["2001-01-29"]
["2001-01-30"]
["2001-01-31"]
["2001-02-01"]
["2001-02-02"]
{"$rows_left_out":5080}